Gender,age_group,TOTALLOS (days),ethnicity,domicile,symptoms___1,symptoms___2,symptoms___3,symptoms___4,symptoms___5,symptoms___6,symptoms___7,symptoms___8,symptoms___10,symptoms___11,symptoms___12,symptoms___13,symptoms___14,symptoms___15,symptoms___9,covid_at_presentation,travel_yn,sickcontacts,exposure,healthcare_worker,symptoms_at_presentation_complete,smoking_history,vaping_history,pregnancy,hypertensionhx,diabeteshx,asthmahx,coronaryheartdiseasehx,copdhx,heartfailurehx,carcinomahx,immunosuppressionhx,ckdhx,medhxother,labs_ordered___4,labs_ordered___15,covid_19_result,lab_results_at_presentation_complete,imaging_ordered___1,imaging_ordered___2,imaging_ordered___3,chest_xray_result,findings_chest_ap,ct_chest_result,findings_ct_chest,imaging_results_at_presentation_complete,oxygen,oxygentype___1,oxygentype___2,oxygentype___3,oxygentype___4,oxygentype___5,invmech_ventilation,ems_intubation,ed_intubation,invmech_vent_time,re_intubated,time_reintubation,re_intubated_third,time_reintubation_2,noninv_mech_ventilation,ed_noninv_mech_vent,noninv_mech_vent_type___1,noninv_mech_vent_type___2,noninv_mech_vent_type___3,time_noninvmech_vent,disposition,ed_diagnosis___1,ed_diagnosis___2,ed_diagnosis___3,ed_diagnosis___4,icu_upgrade,hosp_diagnosis___1,hosp_diagnosis___2,hosp_diagnosis___3,hosp_diagnosis___4,death,code_status,invmechvent,timetoinvvent,noninvmechvent,timetononinvvent,timeto__icu_upgrade,time_to_death,ALTVALUE (IU/L),ASTVALUE (IU/L) ,BICARBVALUE (mmol/L),BNPVALUE (pg/ml),CRPVALUE (mg/dl),CRTVALUE (mg/dL),DBPVALUE (mmHg),DDIMVALUE (mg/L),FERRVALUE (pg/mL),HCO3VALUE (mmol/L),HCRITVALUE (%),HRVALUE (beats/min),KVALUE (mmol/L),LDHVALUE (units/L),LYMPHVALUE (%),NAVALUE (mmol/L),O2VALUE (%),PCO2VALUE (mmHg),PHVALUE,PO2VALUE (mmHg),PROCALVALUE (pg/ml),RRVALUE (rate/min),SBPVALUE (mmHg),TEMPVALUE (⁰C),TNTVALUE (ng/ml),WBCVALUE (x10^3)
Female,4,29.0,2,4.0,1,1,0,0,0,0,0,1,0,0,0,0,0,0,0,0.0,0.0,0.0,0.0,0,2,2.0,4.0,0.0,0.0,0.0,0.0,0.0,1.0,0.0,0.0,0.0,0.0,1.0,1,0,2.0,2,1,0,0,1.0,1.0,,,2,1.0,1,0,0,0,0,0.0,,,,,,,,0.0,,0,0,0,,2,0,1,0,0,0.0,0,0,0,1,0,1.0,0,,0,,,700.0,46.0,22.0,32.0,,9.4,0.53,53.0,,,,33.1,68.0,,,8.3,145.0,96.0,,,,0.12,16.0,108.0,36.8,,12.59
Male,1,2.0,3,1.0,1,0,0,0,0,0,0,0,0,0,0,0,0,0,0,0.0,0.0,0.0,0.0,0,2,3.0,3.0,0.0,0.0,0.0,0.0,0.0,0.0,0.0,0.0,0.0,0.0,1.0,0,1,,2,0,0,1,,,,,2,0.0,0,0,0,0,0,0.0,,,,,,,,0.0,,0,0,0,,2,0,0,0,1,0.0,0,0,0,1,0,1.0,0,,0,,,52.0,,,19.0,,,0.25,74.0,,,,29.7,157.0,,,93.7,133.0,98.0,,,,,40.0,111.0,,,1.65
Male,6,0.0,2,1.0,0,0,0,0,0,0,1,0,0,0,0,0,0,0,0,0.0,0.0,0.0,0.0,0,2,4.0,4.0,0.0,1.0,0.0,0.0,0.0,0.0,0.0,0.0,0.0,0.0,1.0,0,1,,2,1,0,0,2.0,,,,2,0.0,0,0,0,0,0,0.0,,,,,,,,0.0,,0,0,0,,1,0,0,0,1,,0,0,0,0,0,1.0,0,,0,,,9.0,16.0,20.0,27.0,,,0.93,74.0,,,,41.8,88.0,,,9.2,139.0,99.0,,,,,19.0,131.0,36.6,0.01,11.78
Male,6,1.0,2,1.0,0,0,0,0,0,0,0,0,0,0,0,0,0,0,0,0.0,0.0,0.0,0.0,0,2,2.0,4.0,0.0,1.0,0.0,0.0,0.0,0.0,0.0,0.0,0.0,0.0,0.0,1,0,2.0,2,1,0,0,2.0,,,,2,1.0,1,0,0,0,0,0.0,,,,,,,,0.0,,0,0,0,,2,0,0,0,1,,0,0,0,0,0,,0,,0,,,44.0,18.0,19.0,24.0,41.0,0.2,1.05,82.0,421.0,336.9,,49.6,56.0,,190.0,20.8,139.0,95.0,,,,0.04,16.0,196.0,36.7,0.01,9.91
Female,4,8.0,2,1.0,0,0,0,0,0,0,0,1,0,0,0,0,0,0,0,1.0,0.0,1.0,1.0,0,2,4.0,4.0,0.0,0.0,0.0,0.0,0.0,0.0,0.0,0.0,0.0,0.0,1.0,0,1,1.0,2,0,0,1,,,,,2,1.0,1,0,0,0,0,0.0,,,,,,,,0.0,,0,0,0,,2,0,0,0,1,0.0,0,0,0,1,0,1.0,0,,0,,,211.0,15.0,16.0,23.0,,1.6,0.73,73.0,1236.0,520.3,,41.3,73.0,,223.0,9.7,139.0,97.0,,,,0.07,20.0,106.0,36.9,,9.25
Female,4,14.0,2,1.0,0,0,0,0,0,0,0,0,0,0,0,0,0,0,1,0.0,0.0,0.0,0.0,0,2,3.0,4.0,0.0,0.0,0.0,0.0,0.0,0.0,0.0,0.0,0.0,0.0,1.0,1,0,2.0,2,1,0,0,1.0,2.0,,,2,1.0,1,0,1,0,0,1.0,0.0,0.0,2.70833333333333,0.0,,,,1.0,0.0,1,1,1,0.65625,2,0,0,0,1,1.0,0,1,0,1,0,1.0,2,3.0,2,166.0,70.0,352.0,9.0,25.0,20.0,,3.9,1.7,63.0,20742.0,108.0,21.5,33.6,80.0,6.9,,4.4,132.0,92.0,61.1,7.155,96.7,0.48,27.0,116.0,37.1,0.19,6.76
Male,6,15.0,2,1.0,0,0,0,0,0,0,0,0,0,0,0,0,0,0,1,0.0,0.0,0.0,0.0,0,2,3.0,3.0,0.0,0.0,0.0,0.0,0.0,0.0,0.0,1.0,0.0,0.0,0.0,1,0,2.0,2,1,0,0,1.0,1.0,,,2,1.0,1,0,0,0,0,0.0,,,,,,,,0.0,,0,0,0,,2,0,0,0,1,0.0,0,0,0,1,0,1.0,0,,0,,,361.0,15.0,16.0,25.0,,12.1,1.56,76.0,,1063.0,23.0,35.1,90.0,3.5,,6.1,138.0,95.0,43.4,7.332,201.0,,18.0,123.0,36.8,,18.16
Female,1,0.0,3,1.0,0,0,0,0,0,0,0,0,0,0,0,0,0,0,1,1.0,0.0,0.0,0.0,0,2,3.0,4.0,0.0,0.0,0.0,0.0,0.0,0.0,0.0,0.0,0.0,0.0,0.0,0,1,1.0,2,0,0,1,,,,,2,0.0,0,0,0,0,0,0.0,,,,,,,,0.0,,0,0,0,,1,1,0,0,1,,0,0,0,0,0,1.0,0,,0,,,12.0,,,,,,,67.0,,,,,88.0,,,,,98.0,,,,,16.0,102.0,36.9,,
Male,4,23.0,1,1.0,0,1,0,0,0,0,0,0,0,0,0,0,0,0,0,0.0,0.0,1.0,0.0,0,2,3.0,4.0,0.0,0.0,0.0,0.0,0.0,0.0,0.0,0.0,0.0,0.0,0.0,1,0,1.0,2,1,0,0,1.0,2.0,,,2,1.0,1,1,0,0,0,1.0,0.0,0.0,6.67708333333333,0.0,,,,1.0,0.0,0,0,1,0.90625,2,0,1,0,0,1.0,1,0,0,1,0,1.0,2,154.0,2,154.0,155.0,557.0,28.0,41.0,21.0,,15.3,0.77,75.0,3125.0,2615.0,25.0,41.2,85.0,,678.0,17.3,135.0,94.0,34.0,7.48,50.0,0.27,17.0,114.0,37.1,,5.78
Male,6,15.0,2,1.0,1,1,1,1,0,0,0,0,0,0,0,0,0,0,0,0.0,0.0,0.0,0.0,0,2,3.0,4.0,0.0,1.0,1.0,1.0,1.0,0.0,1.0,0.0,0.0,0.0,0.0,1,0,1.0,2,1,0,0,2.0,,,,2,1.0,1,1,1,0,0,1.0,0.0,0.0,8.625,0.0,,,,0.0,,0,0,0,,2,0,1,0,1,1.0,1,0,0,0,1,3.0,2,159.0,0,,158.0,371.0,29.0,59.0,23.0,4225.0,3.7,1.03,67.0,10220.0,43.7,26.0,26.9,84.0,,247.0,21.7,134.0,100.0,49.0,7.34,62.0,0.13,24.0,147.0,36.8,0.01,5.03
Female,4,14.0,2,1.0,1,1,1,0,0,0,0,0,0,0,0,0,0,0,0,0.0,1.0,0.0,0.0,1,2,3.0,4.0,0.0,0.0,0.0,0.0,0.0,0.0,0.0,0.0,0.0,0.0,0.0,1,0,1.0,2,1,1,0,1.0,2.0,1.0,2.0,2,1.0,1,0,1,0,0,1.0,0.0,1.0,10.0979166666666,0.0,,,,0.0,,0,0,0,,3,1,0,0,0,,1,0,0,0,0,1.0,1,0.0,0,,,346.0,16.0,22.0,24.0,338.0,16.2,0.54,63.0,1769.0,276.6,26.0,36.2,79.0,3.4,189.0,3.5,136.0,100.0,40.0,7.43,212.0,0.55,18.0,117.0,37.3,0.15,11.35
Female,5,7.0,2,1.0,0,0,0,0,0,0,0,0,0,0,0,0,0,0,1,0.0,0.0,0.0,0.0,0,2,3.0,,,1.0,0.0,0.0,0.0,0.0,0.0,0.0,0.0,0.0,0.0,1,0,2.0,2,1,0,0,2.0,,,,2,1.0,1,0,0,0,0,1.0,0.0,0.0,3.36458333333333,0.0,,,,0.0,,0,0,0,,3,0,1,0,1,,0,0,0,1,0,1.0,2,13.0,0,,,171.0,27.0,26.0,35.0,9305.0,18.9,5.26,65.0,,,36.0,40.0,83.0,,257.0,3.0,141.0,94.0,50.0,7.48,186.0,153.1,23.0,96.0,36.4,,14.6
Male,4,31.0,1,1.0,0,0,1,0,0,0,0,0,0,0,0,0,0,0,0,0.0,0.0,0.0,0.0,0,2,3.0,3.0,0.0,1.0,0.0,0.0,0.0,0.0,0.0,0.0,0.0,0.0,0.0,1,0,1.0,2,1,0,0,1.0,2.0,,,2,1.0,1,1,1,0,0,1.0,0.0,0.0,10.4791666666666,1.0,3.05902777777777,0.0,,1.0,0.0,0,0,1,0.573611111111111,3,1,0,0,0,,1,0,0,1,0,1.0,2,3.0,2,264.0,,761.0,76.0,46.0,22.0,603.0,30.5,1.08,55.0,16463.0,1119.0,25.0,38.8,99.0,5.2,619.0,1.0,136.0,93.0,54.0,7.29,100.0,0.84,33.0,101.0,37.0,0.01,26.33
Female,3,3.0,2,1.0,0,0,0,1,0,0,0,1,0,0,0,0,0,0,0,0.0,0.0,0.0,0.0,0,2,3.0,4.0,0.0,0.0,0.0,0.0,0.0,0.0,0.0,0.0,0.0,0.0,0.0,1,0,1.0,2,1,1,0,2.0,,2.0,,2,0.0,0,0,0,0,0,0.0,,,,,,,,0.0,,0,0,0,,2,0,0,0,1,0.0,1,0,0,1,0,1.0,0,,0,,,83.0,17.0,26.0,7.0,,,0.67,67.0,,,,40.9,121.0,,,13.2,138.0,98.0,,,,,16.0,129.0,36.8,0.01,20.82
Male,6,15.0,2,1.0,0,1,1,0,0,0,0,0,0,0,0,0,0,0,0,0.0,0.0,0.0,0.0,0,2,2.0,3.0,0.0,1.0,1.0,0.0,0.0,0.0,0.0,0.0,0.0,0.0,1.0,1,0,1.0,2,1,1,0,2.0,,2.0,,2,1.0,1,0,1,0,0,0.0,,,,,,,,0.0,,0,0,0,,3,0,0,0,1,,1,0,0,1,0,3.0,0,,0,,,370.0,36.0,61.0,10.0,2097.0,4.6,3.07,32.0,487.0,174.8,9.7,34.8,92.0,5.2,254.0,6.6,133.0,100.0,37.3,7.025,162.0,2.67,24.0,32.0,35.7,0.48,18.25
Male,3,28.0,2,1.0,0,0,0,1,0,0,0,0,0,0,0,0,0,0,0,0.0,0.0,0.0,0.0,0,2,3.0,3.0,0.0,0.0,0.0,1.0,0.0,0.0,0.0,0.0,0.0,0.0,1.0,1,0,2.0,2,1,0,0,2.0,,,,2,1.0,1,0,0,0,0,0.0,,,,,,,,0.0,,0,0,0,,2,0,0,0,1,0.0,0,0,0,1,0,1.0,0,,0,,,676.0,37.0,19.0,28.0,,10.3,1.52,100.0,3274.0,1096.0,,29.4,62.0,,254.0,11.7,132.0,97.0,,,,0.31,18.0,169.0,36.5,0.01,14.51
Male,4,53.0,2,1.0,0,0,1,1,0,0,0,0,0,0,0,0,0,0,0,1.0,0.0,0.0,0.0,0,2,4.0,4.0,0.0,0.0,0.0,0.0,0.0,0.0,0.0,1.0,1.0,0.0,0.0,0,1,1.0,2,1,1,0,1.0,2.0,1.0,2.0,2,1.0,1,1,1,0,0,1.0,0.0,0.0,27.3013888888888,0.0,,,,0.0,,0,0,0,,3,1,0,0,0,,1,0,0,0,0,2.0,2,23.0,0,,,1278.0,37.0,28.0,24.0,5840.0,8.1,2.21,84.0,10645.0,1128.0,30.0,47.1,87.0,3.9,568.0,3.0,145.0,96.0,48.0,7.42,85.0,0.26,38.0,159.0,37.4,0.01,16.4
Female,5,8.0,2,1.0,0,0,1,0,0,0,1,0,0,0,0,0,0,0,0,0.0,0.0,0.0,0.0,0,2,2.0,3.0,0.0,1.0,0.0,0.0,0.0,1.0,1.0,1.0,0.0,1.0,1.0,1,0,1.0,2,1,0,0,1.0,2.0,,,2,1.0,1,1,1,0,0,0.0,,,,,,,,0.0,,0,0,0,,2,0,1,1,1,0.0,1,0,0,1,0,1.0,0,,0,,,212.0,6.0,13.0,20.0,350000.0,4.1,4.74,78.0,630.0,1315.0,,24.3,87.0,,268.0,5.1,135.0,93.0,,,,2.38,20.0,163.0,36.5,0.16,6.43
Female,6,5.0,3,1.0,0,0,0,0,0,0,0,0,0,0,0,0,0,0,0,0.0,0.0,0.0,0.0,0,2,4.0,4.0,0.0,1.0,0.0,0.0,1.0,0.0,0.0,0.0,0.0,0.0,1.0,1,0,2.0,2,1,0,0,1.0,2.0,,,2,1.0,1,0,0,0,0,0.0,,,,,,,,0.0,,0,0,0,,2,0,1,0,1,0.0,0,0,0,1,0,1.0,0,,0,,,141.0,11.0,18.0,21.0,,0.6,1.0,85.0,150.0,45.3,,34.0,82.0,,215.0,13.9,138.0,96.0,,,,0.14,16.0,135.0,36.7,0.01,13.21
Female,5,3.0,2,1.0,0,0,1,0,0,0,0,0,0,0,0,0,0,0,0,1.0,0.0,0.0,0.0,0,2,2.0,4.0,0.0,1.0,0.0,0.0,0.0,1.0,1.0,1.0,0.0,1.0,1.0,1,0,1.0,2,1,0,0,1.0,2.0,,,2,1.0,1,1,1,0,0,0.0,,,,,,,,0.0,,0,0,0,,2,0,0,1,1,0.0,0,0,1,1,0,1.0,0,,0,,,79.0,6.0,14.0,22.0,350000.0,4.8,5.44,78.0,660.0,1368.0,,26.0,88.0,,209.0,8.7,136.0,96.0,,,,3.04,22.0,165.0,36.8,0.16,8.96
Female,4,5.0,2,1.0,0,1,0,1,0,0,0,0,0,0,0,0,0,0,0,0.0,0.0,0.0,0.0,0,2,1.0,4.0,0.0,1.0,0.0,0.0,1.0,1.0,1.0,0.0,0.0,0.0,1.0,1,0,2.0,2,1,0,0,1.0,2.0,,,2,0.0,0,0,0,0,0,0.0,,,,,,,,0.0,,0,0,0,,2,0,1,0,0,0.0,0,0,0,1,0,1.0,0,,0,,,125.0,30.0,53.0,21.0,1762.0,12.4,1.95,74.0,325.0,126.0,,31.1,60.0,,377.0,9.0,136.0,96.0,,,,0.36,20.0,128.0,36.7,0.01,12.06
Male,6,5.0,2,1.0,0,0,1,0,0,0,0,0,0,0,0,0,0,0,0,1.0,0.0,0.0,0.0,0,2,2.0,4.0,0.0,1.0,1.0,0.0,0.0,0.0,0.0,0.0,0.0,0.0,1.0,1,0,1.0,2,1,0,0,1.0,2.0,,,2,1.0,1,1,1,0,0,1.0,0.0,0.0,0.100694444444444,0.0,,,,0.0,,0,0,0,,2,1,0,0,1,1.0,1,0,0,1,1,1.0,2,135.0,0,,136.0,138.0,38.0,93.0,22.0,4417.0,30.1,2.07,48.0,611.0,547.2,21.0,28.2,100.0,,388.0,6.2,130.0,100.0,29.0,7.48,66.0,0.65,19.0,86.0,37.0,0.05,4.71
Female,6,26.0,2,1.0,0,0,0,0,0,0,0,0,0,0,0,0,1,0,0,1.0,0.0,0.0,0.0,0,2,4.0,4.0,0.0,1.0,0.0,0.0,0.0,0.0,0.0,1.0,0.0,0.0,1.0,1,0,1.0,2,1,0,0,1.0,1.0,,,2,1.0,0,1,1,1,0,1.0,0.0,1.0,3.40069444444444,1.0,5.49513888888888,1.0,2.09513888888888,1.0,0.0,1,1,0,3.0,3,0,0,0,1,,0,0,0,1,1,4.0,1,3.0,2,218.0,,640.0,34.0,37.0,24.0,,,0.82,70.0,2756.0,231.9,24.0,32.7,62.0,4.0,411.0,5.4,141.0,100.0,39.0,7.41,146.0,0.22,14.0,145.0,,0.01,4.51
Female,4,5.0,2,1.0,1,0,0,0,0,0,0,1,0,0,0,0,0,0,0,0.0,0.0,0.0,0.0,0,2,3.0,4.0,0.0,0.0,0.0,0.0,0.0,0.0,0.0,0.0,0.0,0.0,1.0,1,0,2.0,2,1,0,0,1.0,1.0,,,2,1.0,1,0,0,0,0,0.0,,,,,,,,0.0,,0,0,0,,2,0,0,0,1,0.0,0,0,0,1,0,1.0,0,,0,,,120.0,50.0,130.0,26.0,,,0.98,63.0,,,,28.7,111.0,,,13.7,129.0,93.0,,,,0.39,18.0,131.0,37.0,,4.1
Male,6,16.0,2,1.0,0,0,0,1,0,0,0,0,0,0,0,0,0,1,0,0.0,0.0,0.0,0.0,0,2,3.0,4.0,0.0,1.0,1.0,0.0,0.0,0.0,1.0,0.0,0.0,0.0,1.0,1,0,2.0,2,1,1,0,1.0,2.0,1.0,2.0,2,1.0,1,0,0,0,0,0.0,,,,,,,,0.0,,0,0,0,,3,0,0,0,1,,0,0,0,1,0,1.0,0,,0,,,397.0,11.0,17.0,21.0,4000.0,13.9,0.81,58.0,,496.5,,31.3,45.0,4.2,947.0,9.8,135.0,96.0,,,,0.08,35.0,120.0,36.5,0.08,6.41
Male,2,0.0,2,1.0,1,0,0,0,0,0,0,0,1,0,0,0,0,0,0,0.0,1.0,0.0,0.0,0,2,3.0,4.0,0.0,0.0,0.0,0.0,0.0,0.0,0.0,0.0,0.0,0.0,0.0,0,1,,2,0,0,1,,,,,2,0.0,0,0,0,0,0,0.0,,,,,,,,0.0,,0,0,0,,1,0,1,0,1,,0,0,0,0,0,1.0,0,,0,,,4.0,,,,,,,80.0,,,,,95.0,,,,,98.0,,,,,14.0,144.0,37.4,,
Male,2,0.0,2,1.0,1,1,0,0,0,0,0,0,0,0,0,0,1,0,0,0.0,1.0,0.0,0.0,0,2,3.0,3.0,0.0,0.0,0.0,0.0,0.0,0.0,0.0,0.0,0.0,0.0,0.0,0,1,,2,1,0,0,2.0,,,,2,0.0,0,0,0,0,0,0.0,,,,,,,,0.0,,0,0,0,,1,0,1,0,1,,0,0,0,0,0,1.0,0,,0,,,4.0,,,,,,,77.0,,,,,94.0,,,,,99.0,,,,,18.0,123.0,37.6,,
Female,3,47.0,2,1.0,0,0,0,0,0,0,0,0,0,0,0,0,0,0,0,0.0,0.0,1.0,1.0,0,2,3.0,3.0,0.0,0.0,0.0,0.0,0.0,0.0,0.0,0.0,1.0,0.0,1.0,0,1,,2,1,0,0,1.0,1.0,,,2,0.0,0,0,0,0,0,1.0,0.0,0.0,8.38611111111111,1.0,39.1770833333333,,,0.0,,0,0,0,,3,0,0,0,1,,0,0,0,1,1,1.0,2,0.0,0,,,1151.0,,,,,,,,,,,,,,,,,,,,,,,,,,
Male,2,0.0,2,1.0,1,1,0,0,0,1,0,0,1,0,0,0,0,0,0,0.0,1.0,0.0,0.0,0,2,3.0,4.0,0.0,0.0,0.0,0.0,0.0,0.0,0.0,0.0,0.0,0.0,0.0,0,1,,2,1,0,0,2.0,,,,2,0.0,0,0,0,0,0,0.0,,,,,,,,0.0,,0,0,0,,1,0,0,0,1,,0,0,0,0,0,1.0,0,,0,,,8.0,,,28.0,,,1.11,82.0,,,,53.4,101.0,,,5.2,138.0,100.0,,,,,16.0,116.0,37.9,,14.15
Female,3,0.0,2,1.0,1,1,0,0,0,0,0,1,1,1,0,0,1,0,0,0.0,1.0,0.0,0.0,0,2,3.0,4.0,1.0,0.0,0.0,0.0,0.0,0.0,0.0,0.0,0.0,0.0,0.0,0,1,,2,1,0,0,2.0,,,,2,0.0,0,0,0,0,0,0.0,,,,,,,,0.0,,0,0,0,,1,0,1,0,0,,0,0,0,0,0,1.0,0,,0,,,4.0,,,,,,,65.0,,,,,108.0,,,,,97.0,,,,,18.0,102.0,37.6,,
Male,3,0.0,2,1.0,1,1,0,0,1,1,0,0,0,1,0,0,1,1,0,0.0,1.0,0.0,0.0,0,2,3.0,4.0,0.0,0.0,0.0,0.0,0.0,0.0,0.0,0.0,0.0,0.0,0.0,0,1,,2,1,0,0,2.0,,,,2,0.0,0,0,0,0,0,0.0,,,,,,,,0.0,,0,0,0,,1,0,1,0,0,,0,0,0,0,0,1.0,0,,0,,,4.0,,,,,,,98.0,,,,,93.0,,,,,98.0,,,,,20.0,152.0,37.2,,
Male,4,0.0,2,1.0,1,0,0,0,0,0,0,0,0,0,0,0,0,0,0,0.0,1.0,0.0,0.0,0,2,3.0,4.0,0.0,0.0,0.0,0.0,0.0,0.0,0.0,0.0,0.0,0.0,0.0,0,1,,2,1,0,0,2.0,,,,2,0.0,0,0,0,0,0,0.0,,,,,,,,0.0,,0,0,0,,1,0,1,0,1,,0,0,0,0,0,1.0,0,,0,,,3.0,,,27.0,,,1.08,84.0,,,,44.8,82.0,,,23.4,137.0,97.0,,,,,16.0,122.0,36.9,,6.53
Male,1,0.0,2,1.0,0,1,0,0,0,0,0,0,0,1,0,0,0,0,0,0.0,1.0,0.0,0.0,0,2,3.0,3.0,0.0,0.0,0.0,0.0,0.0,0.0,0.0,0.0,0.0,0.0,1.0,0,1,,2,1,0,0,2.0,,,,2,0.0,0,0,0,0,0,0.0,,,,,,,,0.0,,0,0,0,,1,0,0,0,1,,0,0,0,0,0,1.0,0,,0,,,4.0,,,,,,,82.0,,,,,75.0,,,,,98.0,,,,,18.0,113.0,37.1,,
Female,4,0.0,2,1.0,0,0,0,0,0,0,0,0,0,0,0,0,0,0,1,0.0,1.0,0.0,0.0,0,2,3.0,4.0,0.0,1.0,0.0,0.0,0.0,0.0,0.0,0.0,0.0,0.0,1.0,0,1,,2,0,0,1,,,,,2,0.0,0,0,0,0,0,0.0,,,,,,,,0.0,,0,0,0,,1,0,0,0,1,,0,0,0,0,0,1.0,0,,0,,,2.0,,,,,,,86.0,,,,,92.0,,,,,100.0,,,,,16.0,133.0,36.8,,
Male,4,4.0,3,1.0,1,1,1,1,1,1,0,0,0,0,0,0,0,1,0,0.0,0.0,0.0,0.0,0,2,2.0,2.0,0.0,0.0,0.0,0.0,0.0,0.0,0.0,0.0,0.0,0.0,0.0,1,0,2.0,2,1,0,0,1.0,2.0,,,2,1.0,1,0,0,0,0,0.0,,,,,,,,0.0,,0,0,0,,2,0,1,0,0,0.0,0,1,0,1,0,1.0,0,,0,,,116.0,28.0,43.0,25.0,,,0.85,80.0,386.0,,,38.4,96.0,,465.0,9.6,137.0,93.0,,,,0.16,24.0,145.0,38.0,,13.75
Female,4,2.0,2,1.0,1,1,0,0,1,0,0,1,0,0,0,0,0,0,0,0.0,0.0,0.0,0.0,0,2,3.0,3.0,0.0,1.0,1.0,0.0,0.0,0.0,0.0,0.0,1.0,0.0,1.0,0,1,,2,1,1,0,2.0,,1.0,2.0,2,0.0,0,0,0,0,0,0.0,,,,,,,,0.0,,0,0,0,,2,0,1,0,1,0.0,0,1,0,1,0,1.0,0,,0,,,70.0,98.0,48.0,23.0,,,0.79,76.0,,,,35.6,111.0,,,11.5,135.0,95.0,,,,,22.0,126.0,38.0,,14.11
Male,4,0.0,2,1.0,0,0,1,0,0,0,0,0,0,0,0,0,0,0,0,0.0,0.0,0.0,0.0,0,2,1.0,3.0,0.0,0.0,1.0,0.0,1.0,1.0,0.0,0.0,0.0,0.0,0.0,0,1,,2,1,0,0,1.0,1.0,,,2,1.0,1,0,0,0,0,0.0,,,,,,,,0.0,,0,0,0,,1,0,1,0,0,,0,0,0,0,0,1.0,0,,0,,,22.0,,,29.0,,,0.88,73.0,,,,42.0,102.0,,,9.0,139.0,89.0,,,,,24.0,143.0,37.1,0.01,18.81
Female,7,1.0,1,1.0,1,1,1,0,0,0,0,0,0,0,0,0,0,0,0,0.0,0.0,1.0,0.0,0,2,4.0,4.0,0.0,1.0,0.0,0.0,0.0,0.0,0.0,0.0,0.0,0.0,0.0,0,1,,2,1,1,0,1.0,1.0,1.0,2.0,2,1.0,1,0,0,0,0,0.0,,,,,,,,0.0,,0,0,0,,2,0,1,0,0,0.0,0,1,0,0,0,1.0,0,,0,,,43.0,43.0,26.0,26.0,1335.0,,0.96,76.0,,,,40.2,83.0,,,1.8,133.0,94.0,,,,0.15,19.0,176.0,37.3,0.01,21.35
Female,6,22.0,2,1.0,0,0,0,0,0,0,0,0,0,0,0,0,0,0,1,0.0,0.0,0.0,0.0,0,2,3.0,4.0,0.0,1.0,1.0,0.0,0.0,0.0,0.0,1.0,0.0,0.0,0.0,0,1,,2,0,0,1,,,,,2,0.0,0,0,0,0,0,0.0,,,,,,,,0.0,,0,0,0,,2,0,0,0,1,0.0,0,0,0,1,0,1.0,0,,0,,,551.0,,,25.0,,,0.64,77.0,,46.6,,36.0,96.0,,225.0,5.5,131.0,97.0,,,,,22.0,194.0,37.3,,15.18
Female,4,21.0,2,1.0,0,0,0,0,0,0,0,0,0,0,0,0,0,0,1,0.0,0.0,0.0,0.0,0,2,2.0,3.0,0.0,0.0,1.0,0.0,0.0,0.0,0.0,0.0,0.0,0.0,1.0,0,1,,2,0,0,1,,,,,2,0.0,0,0,0,0,0,0.0,,,,,,,,0.0,,0,0,0,,2,0,0,0,1,0.0,0,0,0,1,0,1.0,0,,0,,,527.0,23.0,24.0,31.0,,0.4,0.68,69.0,,19.2,,40.5,105.0,,,20.9,141.0,98.0,,,,,18.0,107.0,36.7,,10.84
Male,5,7.0,1,1.0,0,0,1,0,0,0,0,1,0,0,0,0,0,0,0,0.0,0.0,0.0,0.0,0,2,3.0,3.0,0.0,1.0,0.0,1.0,1.0,0.0,0.0,1.0,1.0,1.0,0.0,0,1,,2,1,0,0,1.0,1.0,,,2,1.0,1,0,0,0,0,1.0,0.0,0.0,5.57569444444444,0.0,,,,0.0,,0,0,0,,2,0,1,0,0,1.0,0,1,0,0,1,1.0,2,35.0,0,,32.0,174.0,23.0,18.0,27.0,20015.0,,8.1,65.0,,,26.0,35.0,142.0,,233.0,2.6,138.0,93.0,47.0,7.35,73.0,33.8,28.0,154.0,37.9,0.08,18.7
Male,1,0.0,2,1.0,0,0,0,0,0,0,0,0,0,1,0,0,0,0,0,0.0,1.0,0.0,0.0,0,2,3.0,3.0,0.0,0.0,0.0,0.0,0.0,0.0,0.0,0.0,0.0,0.0,1.0,0,1,,2,1,0,0,2.0,,,,2,0.0,0,0,0,0,0,0.0,,,,,,,,0.0,,0,0,0,,1,0,1,0,0,,0,0,0,0,0,1.0,0,,0,,,3.0,,,,,,,75.0,,,,,82.0,,,,,99.0,,,,,24.0,142.0,37.4,,
Male,4,9.0,2,1.0,0,0,1,0,0,0,0,0,0,0,0,0,0,0,0,0.0,0.0,0.0,0.0,0,2,1.0,4.0,0.0,0.0,0.0,0.0,0.0,1.0,0.0,0.0,0.0,0.0,0.0,0,1,,2,1,1,0,2.0,,2.0,,2,1.0,1,0,1,0,0,0.0,,,,,,,,1.0,0.0,0,1,0,1.92222222222222,2,0,0,0,1,0.0,0,1,0,1,0,1.0,0,,2,2.0,,225.0,12.0,21.0,30.0,212.0,,0.83,93.0,,,30.0,44.2,85.0,,,26.8,139.0,91.0,65.0,7.28,92.0,0.05,26.0,158.0,36.4,0.01,6.79
Female,3,9.0,2,1.0,0,1,1,1,0,0,0,0,1,0,0,0,0,0,0,0.0,0.0,0.0,0.0,0,2,2.0,4.0,0.0,0.0,0.0,0.0,0.0,0.0,0.0,0.0,0.0,0.0,0.0,0,1,,2,1,1,0,2.0,,1.0,2.0,2,1.0,1,0,0,0,0,0.0,,,,,,,,0.0,,0,0,0,,2,0,0,0,1,0.0,0,0,0,1,0,1.0,0,,0,,,222.0,24.0,26.0,21.0,1591.0,39.1,1.03,93.0,,192.1,,38.0,124.0,,,8.8,135.0,90.0,,,,0.57,20.0,136.0,37.4,0.01,15.45
Female,4,0.0,2,1.0,1,1,1,0,0,1,0,0,1,1,0,0,0,0,0,0.0,1.0,1.0,0.0,0,2,3.0,4.0,0.0,0.0,0.0,0.0,0.0,0.0,0.0,0.0,0.0,0.0,0.0,1,0,2.0,2,1,0,0,2.0,,,,2,0.0,0,0,0,0,0,0.0,,,,,,,,0.0,,0,0,0,,1,0,0,0,1,,0,0,0,0,0,1.0,0,,0,,,5.0,,,,,,,77.0,,,,,88.0,,,,,95.0,,,,,16.0,132.0,37.2,,
Female,2,0.0,2,1.0,1,1,0,0,0,0,0,0,0,1,0,0,0,0,0,0.0,1.0,0.0,0.0,0,2,3.0,3.0,0.0,0.0,0.0,0.0,0.0,0.0,0.0,0.0,0.0,0.0,0.0,0,1,,2,1,0,0,2.0,,,,2,0.0,0,0,0,0,0,0.0,,,,,,,,0.0,,0,0,0,,1,0,1,0,0,,0,0,0,0,0,1.0,0,,0,,,4.0,,,,,,,70.0,,,,,86.0,,,,,98.0,,,,,16.0,115.0,36.9,,
Male,7,7.0,2,1.0,0,0,0,0,0,0,1,1,0,0,0,0,0,0,0,0.0,0.0,0.0,0.0,0,2,3.0,4.0,0.0,1.0,0.0,0.0,0.0,0.0,0.0,0.0,0.0,0.0,0.0,1,0,2.0,2,1,0,0,1.0,1.0,,,2,1.0,1,0,0,0,0,0.0,,,,,,,,0.0,,0,0,0,,2,0,1,0,1,0.0,0,1,0,1,0,1.0,0,,0,,,191.0,15.0,18.0,23.0,890.0,,1.01,80.0,,,23.0,51.1,107.0,,,6.3,139.0,95.0,40.0,7.38,64.0,0.13,16.0,135.0,36.9,0.02,7.02
Female,3,7.0,2,1.0,1,1,0,0,1,0,0,0,0,0,0,0,0,0,0,0.0,0.0,0.0,0.0,0,2,3.0,3.0,0.0,1.0,1.0,1.0,0.0,0.0,0.0,0.0,1.0,1.0,0.0,1,0,2.0,2,1,0,0,1.0,2.0,,,2,0.0,0,0,0,0,0,0.0,,,,,,,,0.0,,0,0,0,,2,0,1,0,0,0.0,0,1,0,0,0,1.0,0,,0,,,189.0,8.0,6.0,20.0,,8.1,2.12,83.0,,,,33.6,110.0,,,14.2,136.0,96.0,,,,0.07,18.0,121.0,37.3,0.01,7.1
Female,4,1.0,2,1.0,1,1,1,0,0,0,0,0,0,0,0,0,0,0,0,0.0,0.0,1.0,0.0,0,2,3.0,4.0,0.0,1.0,1.0,0.0,0.0,0.0,0.0,0.0,0.0,0.0,0.0,0,1,,2,1,0,0,2.0,,,,2,1.0,1,0,0,0,0,0.0,,,,,,,,0.0,,0,0,0,,2,0,0,0,1,0.0,0,1,0,0,0,1.0,0,,0,,,44.0,14.0,12.0,25.0,,,0.59,79.0,,,,44.4,121.0,,,12.3,134.0,93.0,,,,0.15,22.0,139.0,38.9,0.01,6.97
Female,4,14.0,2,1.0,1,1,1,0,1,1,0,0,0,0,0,0,0,0,0,0.0,0.0,0.0,0.0,0,2,4.0,4.0,0.0,1.0,1.0,1.0,0.0,0.0,0.0,0.0,0.0,0.0,0.0,0,1,,2,1,0,0,1.0,1.0,,,2,1.0,1,0,1,0,0,1.0,0.0,0.0,6.34375,0.0,,,,0.0,,0,0,0,,3,0,0,0,1,,0,0,0,1,0,1.0,2,8.0,0,,,355.0,,,,,,,,,,,,,,,,,,,,,,,,,,
Male,7,2.0,2,1.0,0,0,1,0,0,0,0,0,0,0,0,0,0,0,0,0.0,0.0,0.0,0.0,0,2,3.0,4.0,0.0,1.0,0.0,0.0,0.0,0.0,0.0,1.0,1.0,0.0,0.0,0,1,,2,1,1,0,2.0,,2.0,,2,1.0,1,0,0,0,0,0.0,,,,,,,,0.0,,0,0,0,,2,0,1,0,0,0.0,0,1,0,0,0,1.0,0,,0,,,69.0,20.0,32.0,19.0,,,1.74,90.0,,484.9,,39.6,104.0,,,16.9,129.0,87.0,,,,,16.0,150.0,36.4,0.08,12.86
Female,6,40.0,2,1.0,0,0,0,1,0,0,0,0,0,0,0,0,0,0,0,0.0,0.0,0.0,0.0,0,2,3.0,4.0,0.0,1.0,0.0,0.0,0.0,0.0,1.0,0.0,0.0,0.0,1.0,1,0,2.0,2,1,0,0,1.0,2.0,,,2,0.0,0,0,0,0,0,1.0,0.0,0.0,40.4965277777777,0.0,,,,0.0,,0,0,0,,3,0,0,1,0,,0,0,1,0,0,3.0,2,0.0,0,,,972.0,53.0,59.0,23.0,109090.0,0.4,0.2,102.0,,,26.0,36.6,109.0,,,1.7,122.0,98.0,55.0,7.29,138.0,3.54,16.0,216.0,37.0,0.03,86.26
Male,4,0.0,2,1.0,1,1,0,0,1,0,0,0,0,0,0,0,0,0,0,0.0,0.0,0.0,0.0,0,2,3.0,4.0,0.0,0.0,1.0,0.0,0.0,0.0,0.0,0.0,0.0,0.0,0.0,0,1,,2,1,0,0,2.0,,,,2,0.0,0,0,0,0,0,0.0,,,,,,,,0.0,,0,0,0,,1,0,1,0,0,,0,0,0,0,0,1.0,0,,0,,,3.0,,,27.0,,,1.0,79.0,,,,52.5,82.0,,,34.0,139.0,98.0,,,,,18.0,121.0,36.9,,4.77
Male,2,5.0,2,1.0,0,1,1,1,1,0,0,0,0,0,0,0,0,0,0,0.0,0.0,0.0,0.0,0,2,3.0,4.0,0.0,0.0,0.0,0.0,0.0,0.0,0.0,0.0,0.0,0.0,0.0,1,0,2.0,2,1,1,0,1.0,1.0,1.0,2.0,2,1.0,1,1,0,0,0,0.0,,,,,,,,0.0,,0,0,0,,2,0,1,0,0,0.0,0,1,0,0,0,1.0,0,,0,,,134.0,38.0,25.0,27.0,35.0,,1.12,65.0,490.0,,26.0,49.7,151.0,,,26.2,144.0,82.0,44.0,7.39,80.0,31.09,20.0,129.0,36.8,0.01,3.63
Male,6,4.0,2,1.0,0,1,1,1,1,1,0,0,0,0,0,0,0,0,0,0.0,0.0,0.0,0.0,0,2,4.0,4.0,0.0,1.0,0.0,0.0,0.0,0.0,0.0,0.0,0.0,0.0,0.0,1,0,2.0,2,1,0,0,1.0,2.0,,,2,1.0,1,0,1,0,0,1.0,0.0,0.0,1.70972222222222,0.0,,,,1.0,0.0,0,1,0,2.25138888888888,2,0,1,1,0,1.0,0,1,0,1,1,2.0,2,71.0,2,14.0,65.0,112.0,59.0,76.0,13.0,25274.0,4.6,1.33,56.0,18031.0,,15.0,35.2,132.0,,12140.0,5.8,126.0,74.0,20.0,7.5,73.0,0.66,20.0,96.0,36.3,0.06,14.03
Male,5,4.0,2,2.0,1,1,1,0,1,0,0,0,0,0,0,0,0,0,0,0.0,0.0,0.0,0.0,0,2,1.0,4.0,0.0,1.0,0.0,1.0,1.0,1.0,0.0,0.0,0.0,0.0,0.0,1,0,2.0,2,1,0,0,2.0,,,,2,1.0,1,0,0,0,0,0.0,,,,,,,,0.0,,0,0,0,,2,0,1,0,0,0.0,0,1,0,0,0,1.0,0,,0,,,114.0,9.0,13.0,22.0,,7.3,0.89,72.0,,,,32.5,96.0,,,12.3,137.0,94.0,,,,0.06,16.0,117.0,39.5,,9.15
Male,4,13.0,2,1.0,1,0,0,0,0,0,0,0,0,1,0,0,0,0,0,0.0,0.0,0.0,0.0,0,2,3.0,4.0,0.0,1.0,0.0,0.0,0.0,0.0,0.0,1.0,1.0,0.0,0.0,1,0,2.0,2,1,0,0,2.0,,,,2,0.0,0,0,0,0,0,0.0,,,,,,,,0.0,,0,0,0,,2,0,0,0,1,0.0,0,1,0,1,0,1.0,0,,0,,,332.0,96.0,166.0,21.0,,,1.1,61.0,,,,23.5,97.0,,253.0,81.1,133.0,97.0,,,,,18.0,118.0,37.3,0.01,5.75
Female,6,12.0,2,2.0,1,1,0,0,1,0,0,1,0,0,0,0,0,0,0,0.0,0.0,0.0,0.0,0,2,3.0,4.0,0.0,1.0,0.0,0.0,0.0,0.0,0.0,0.0,0.0,0.0,1.0,1,0,2.0,2,1,1,0,2.0,,1.0,2.0,2,1.0,1,1,1,0,0,0.0,,,,,,,,0.0,,0,0,0,,2,0,1,0,0,0.0,0,1,0,0,0,1.0,0,,0,,,309.0,11.0,20.0,18.0,,7.7,3.45,75.0,,272.5,17.0,28.7,95.0,,354.0,0.9,137.0,93.0,34.0,7.32,155.0,3.35,18.0,131.0,37.8,0.1,22.14
Male,3,5.0,2,1.0,1,0,1,0,0,1,0,0,0,0,0,0,0,0,0,0.0,1.0,0.0,0.0,0,2,3.0,4.0,0.0,0.0,0.0,0.0,0.0,0.0,0.0,0.0,0.0,0.0,0.0,1,0,1.0,2,1,1,0,1.0,2.0,1.0,2.0,2,0.0,0,0,0,0,0,0.0,,,,,,,,0.0,,0,0,0,,2,0,1,0,0,0.0,1,0,0,0,0,1.0,0,,0,,,130.0,37.0,40.0,29.0,,,1.46,70.0,,,,48.6,108.0,,,18.3,138.0,97.0,,,,0.23,22.0,125.0,38.1,0.01,2.89
Female,4,0.0,2,1.0,0,1,0,0,0,1,0,0,0,0,0,0,0,0,0,0.0,1.0,1.0,0.0,0,2,3.0,4.0,0.0,0.0,0.0,0.0,0.0,0.0,0.0,0.0,0.0,0.0,0.0,0,1,,2,1,0,0,2.0,,,,2,0.0,0,0,0,0,0,0.0,,,,,,,,0.0,,0,0,0,,1,0,0,0,1,,0,0,0,0,0,1.0,0,,0,,,5.0,,,25.0,,,0.62,66.0,,,,33.4,74.0,,,20.3,141.0,100.0,,,,,16.0,118.0,37.0,,5.53
Female,1,0.0,2,1.0,0,1,0,0,1,1,0,0,1,0,0,0,0,0,0,0.0,1.0,0.0,0.0,0,2,3.0,3.0,0.0,0.0,0.0,0.0,0.0,0.0,0.0,0.0,0.0,0.0,0.0,0,1,,2,0,0,1,,,,,2,0.0,0,0,0,0,0,0.0,,,,,,,,0.0,,0,0,0,,1,0,1,0,0,,0,0,0,0,0,1.0,0,,0,,,3.0,,,,,,,78.0,,,,,81.0,,,,,100.0,,,,,18.0,136.0,36.6,,
Female,6,10.0,2,2.0,0,0,0,0,0,0,0,1,0,0,0,0,0,1,0,0.0,0.0,0.0,0.0,0,2,2.0,3.0,0.0,1.0,1.0,1.0,0.0,0.0,0.0,0.0,0.0,0.0,0.0,1,0,2.0,2,1,1,0,2.0,,2.0,,2,1.0,1,0,0,0,0,0.0,,,,,,,,0.0,,0,0,0,,2,0,1,0,0,0.0,0,1,0,0,0,1.0,0,,0,,,258.0,151.0,385.0,38.0,7897.0,0.6,1.07,85.0,,,,34.2,96.0,,,10.2,142.0,100.0,,,,0.07,16.0,183.0,36.0,0.04,7.53
Male,2,0.0,2,1.0,1,1,0,0,0,0,0,0,0,0,0,0,0,0,0,0.0,0.0,0.0,0.0,0,2,3.0,4.0,0.0,0.0,0.0,0.0,0.0,0.0,0.0,0.0,0.0,0.0,0.0,1,0,2.0,2,1,0,0,2.0,,,,2,0.0,0,0,0,0,0,0.0,,,,,,,,0.0,,0,0,0,,1,0,0,0,1,,0,0,0,0,0,1.0,0,,0,,,4.0,34.0,29.0,27.0,,,1.2,85.0,,,,41.9,130.0,,,9.6,137.0,97.0,,,,,18.0,145.0,39.4,,7.78
Male,2,0.0,2,1.0,1,0,0,0,0,0,0,0,0,1,0,0,0,0,0,0.0,0.0,1.0,1.0,0,2,1.0,4.0,0.0,0.0,0.0,0.0,0.0,0.0,0.0,0.0,0.0,0.0,0.0,1,0,2.0,2,1,0,0,2.0,,,,2,0.0,0,0,0,0,0,0.0,,,,,,,,0.0,,0,0,0,,1,0,0,0,1,,0,0,0,0,0,1.0,0,,0,,,8.0,55.0,56.0,25.0,,,0.89,73.0,,,,40.9,130.0,,,9.0,136.0,99.0,,,,,17.0,108.0,38.8,,9.23
Male,4,0.0,2,1.0,1,1,0,0,0,0,0,0,0,0,0,0,0,0,0,0.0,1.0,1.0,0.0,0,2,3.0,4.0,0.0,0.0,0.0,0.0,0.0,0.0,0.0,0.0,0.0,0.0,0.0,1,0,2.0,2,1,0,0,1.0,2.0,,,2,0.0,0,0,0,0,0,0.0,,,,,,,,0.0,,0,0,0,,1,0,0,0,1,,0,0,0,0,0,1.0,0,,0,,,5.0,,,25.0,,,1.16,81.0,,,,46.3,89.0,,,25.7,142.0,96.0,,,,,17.0,176.0,37.0,,6.31
Female,5,0.0,2,1.0,0,0,0,1,0,0,1,0,0,0,0,0,0,0,0,0.0,0.0,0.0,0.0,0,2,2.0,3.0,0.0,0.0,0.0,0.0,0.0,1.0,0.0,1.0,1.0,0.0,0.0,1,0,2.0,2,1,0,0,1.0,2.0,,,2,1.0,0,1,1,0,0,1.0,0.0,1.0,0.0652777777777777,0.0,,,,0.0,,0,0,0,,4,0,0,0,1,,0,0,0,0,1,3.0,1,11.0,0,,,17.0,6.0,11.0,20.0,,,0.68,60.0,,,23.0,29.7,146.0,,,0.8,135.0,92.0,57.0,7.23,59.0,,36.0,126.0,,0.01,18.45
Male,2,6.0,2,1.0,1,1,0,0,0,0,0,1,1,0,0,0,1,0,0,0.0,1.0,1.0,0.0,0,2,3.0,3.0,0.0,0.0,0.0,0.0,0.0,0.0,0.0,0.0,0.0,0.0,0.0,1,0,1.0,2,1,0,0,1.0,2.0,,,2,1.0,1,0,1,0,0,0.0,,,,,,,,0.0,,0,0,0,,2,0,1,0,1,0.0,1,0,0,1,0,1.0,0,,0,,,162.0,22.0,32.0,23.0,,,1.06,75.0,,,20.0,38.4,110.0,,491.0,14.0,136.0,95.0,29.0,7.47,72.0,0.34,20.0,125.0,38.8,,5.14
Female,6,4.0,2,1.0,1,1,1,0,0,0,0,0,0,0,0,0,0,0,0,0.0,0.0,0.0,0.0,0,2,3.0,4.0,0.0,1.0,0.0,1.0,0.0,0.0,1.0,0.0,0.0,0.0,1.0,1,0,2.0,2,1,0,0,1.0,2.0,,,2,1.0,1,0,1,0,0,0.0,,,,,,,,0.0,,0,0,0,,2,0,1,0,0,0.0,0,1,0,0,0,1.0,0,,0,,,108.0,16.0,20.0,19.0,3416.0,,1.09,62.0,168.0,,,27.3,112.0,,,7.4,136.0,80.0,,,,,30.0,155.0,37.9,0.01,17.94